{"text_format":"1","workbook":"xlsx","n_sheets":3,"sheets":["Anlagenübersicht","MBT-Anlagenmatrix","Version"],"not_rendered":{"charts":0,"images":3,"macros":1,"external_links":0,"defined_names":0,"comments":0,"pivot_tables":0},"unopened":[],"bounds":{"document_bytes":16777216,"sheet_cells":100000,"rows_first":2000,"rows_last":500,"rows_between":2000,"halvings":0,"cell_chars":16384,"cell_head_chars":4096},"cells_cut":0,"cells_raw":0,"read":"whole","date_system":"1900"}

{"sheet":"Anlagenübersicht","index":0,"n_rows":19,"n_cols":3,"rows_kept":19,"cut":false,"hidden":false,"merged":[[13,0,13,2]]}
["Projektdaten"]
[]
["Projektdaten","Inhalt"]
["Hersteller:"]
["Anschrift des Herstellers:"]
["Version dieses Gesamtdokuments:"]
["Datum der letzten Änderung:"]
["Bezeichnung der Maschine:"]
["Maschinentyp:"]
["Seriennummer:"]
["Baujahr:"]
[]
[]
["Schnittstellenbeschreibung"]
[]
["Schnittstelle","Beschreibung","Ergebnis"]
["S1","Roboter 1 übergibt an Förderband 1",{"$f":"Anlagenmatrix[[#Totals],[S1]]","v":"Anlage"}]
["S2","Forderband 1 übergibt an Förderband 2",{"$f":"Anlagenmatrix[[#Totals],[S2]]","v":"Einzelmaschinen"}]
["S3","Förderband 2 übergibt an Roboter 2",{"$f":"Anlagenmatrix[[#Totals],[S3]]","v":"Anlage"}]

{"sheet":"MBT-Anlagenmatrix","index":1,"n_rows":12,"n_cols":7,"rows_kept":12,"cut":false,"hidden":false,"merged":[]}
[{"$f":"_xlfn.CONCAT(Version!B3,Version!A2)","v":"MBT-AnMa Anlagenmatrix \nnach maschinenrichtlinie.de \n© MBT Mechtersheimer GbR \nVersion 1.0"}]
[]
["Maschinenteile sind als Gesamtheit","S1","Kommentar S1","S2","Kommentar S2","S3","Kommentar S3"]
["angeordnet","ja","Übergabe Produkt","ja","Übergabe Produkt","ja","Siehe S1"]
["zusammenwirken","ja","Produkt wird durchgereicht","ja","Produkt wird durchgereicht","ja"]
["betätigt","ja","Gemeinsame Steuerung (AUS - Produktionstechnisch)","ja","Gemeinsame Steuerung (AUS - Produktionstechnisch)","ja"]
["funktionieren",{"$f":"IF(AND(B8=\"ja\",B9=\"ja\",OR(B10=\"nein\",B11=\"nein\")),\"ja\",IF(OR(B8=\"nein\",B9=\"nein\",AND(B10=\"ja\",B11=\"ja\")),\"nein\",\"?\"))","v":"ja"},null,{"$f":"IF(AND(D8=\"ja\",D9=\"ja\",OR(D10=\"nein\",D11=\"nein\")),\"ja\",IF(OR(D8=\"nein\",D9=\"nein\",AND(D10=\"ja\",D11=\"ja\")),\"nein\",\"?\"))","v":"nein"},null,{"$f":"IF(AND(F8=\"ja\",F9=\"ja\",OR(F10=\"nein\",F11=\"nein\")),\"ja\",IF(OR(F8=\"nein\",F9=\"nein\",AND(F10=\"ja\",F11=\"ja\")),\"nein\",\"?\"))","v":"ja"}]
["Gefährdungsübertrag","ja","Roboter gefährdet Arbeitsbereich Förderband","ja","Wenn F2 steht können Personen an der Schnittstelle duch F1 eingezogen werden","ja"]
["Sicherheitstechnische Maßnahmen erforderlich","ja","Bei Zugang zum Förderband muss Roboter stillstehen","ja","Übergang F1 F2 muss abgesichert werden","ja"]
["Gefährdung gering","nein","Roboter kann Personen schwer verletzen","ja","Nur leichte Handverletzung möglich","nein"]
["Sicherheitstechnische Maßnahmen einfach","nein","Steuerungstechnik erforderlich","ja","Feststehende Schutzeinrichtung (Keil zwischen F1 und F2 mit Spalt kleiner Fingerdicke)","nein"]
["Ergebnis",{"$f":"IF(AND(B4=\"ja\",B5=\"ja\",B6=\"ja\",B7=\"ja\"),\"Anlage\",IF(OR(B4=\"nein\",B5=\"nein\",B6=\"nein\",B7=\"nein\"),\"Einzelmaschinen\",\"?\"))","v":"Anlage"},null,{"$f":"IF(AND(D4=\"ja\",D5=\"ja\",D6=\"ja\",D7=\"ja\"),\"Anlage\",IF(OR(D4=\"nein\",D5=\"nein\",D6=\"nein\",D7=\"nein\"),\"Einzelmaschinen\",\"?\"))","v":"Einzelmaschinen"},null,{"$f":"IF(AND(F4=\"ja\",F5=\"ja\",F6=\"ja\",F7=\"ja\"),\"Anlage\",IF(OR(F4=\"nein\",F5=\"nein\",F6=\"nein\",F7=\"nein\"),\"Einzelmaschinen\",\"?\"))","v":"Anlage"}]

{"sheet":"Version","index":2,"n_rows":4,"n_cols":3,"rows_kept":4,"cut":false,"hidden":false,"merged":[]}
["Version","Deutsch","English"]
["1.0","Anleitung auf www.maschinenrichtlinie.de","Instructions of use at www.maschinenrichtlinie.com"]
[null,"MBT-AnMa Anlagenmatrix \nnach maschinenrichtlinie.de \n© MBT Mechtersheimer GbR \nVersion ","MBT-AnMa Assemblymatrix\nbased on maschinenrichtlinie.com\n© MBT Mechtersheimer GbR\nVersion "]
[null,"Lizenz:\nCC BY 3.0 DE\nNamensnennung 3.0 Deutschland","License:\nCC BY 3.0 DE\nNamensnennung 3.0 Deutschland"]